﻿Year,EmployerType,EmployerName,DepartmentOrSubdivision,Position,ElectedOfficial,Judicial,OtherPositions,MinPositionSalary,MaxPositionSalary,ReportedBaseWage,RegularPay,OvertimePay,LumpSumPay,OtherPay,TotalWages,DefinedBenefitPlanContribution,EmployeesRetirementCostCovered,DeferredCompensationPlan,HealthDentalVision,TotalRetirementAndHealthContribution,PensionFormula,EmployerURL,EmployerPopulation,LastUpdatedDate,EmployerCounty,SpecialDistrictActivities,IncludesUnfundedLiability,SpecialDistrictType
2016,Special District,Orange County Transportation Authority,Chief Executive Office,Chief Executive Officer,False,False,,87360,312000,,314043,,20871,22115,357029,72724,,36752,26583,136059,1.667% @ 57.5,https://careers.octa.net/octa-careers/,,09/19/2017,Orange,Transportation Planning,,Transportation Planning Agencies
2016,Special District,Orange County Transportation Authority,Chief Executive Office,Deputy Chief Executive Officer,False,False,,87360,312000,,255827,,24108,20650,300585,81096,8097,29689,8503,127385,1.667% @ 57.5,https://careers.octa.net/octa-careers/,,09/19/2017,Orange,Transportation Planning,,Transportation Planning Agencies
2016,Special District,Orange County Transportation Authority,Chief Executive Office,Executive Director,False,False,,87360,312000,,223041,,29675,22692,275408,71830,6954,9219,18085,106088,1.667% @ 57.5,https://careers.octa.net/octa-careers/,,09/19/2017,Orange,Transportation Planning,,Transportation Planning Agencies
2016,Special District,Orange County Transportation Authority,Finance & Administration,General Manager,False,False,,87360,312000,,215548,,28962,19934,264444,71717,5207,15669,10330,102923,1.667% @ 57.5,https://careers.octa.net/octa-careers/,,09/19/2017,Orange,Transportation Planning,,Transportation Planning Agencies
2016,Special District,Orange County Transportation Authority,Capital Programs,Director,False,False,,87360,312000,,213411,,28911,17327,259649,71088,5321,8645,28352,113406,1.667% @ 57.5,https://careers.octa.net/octa-careers/,,09/19/2017,Orange,Transportation Planning,,Transportation Planning Agencies
2016,Special District,Orange County Transportation Authority,Chief Executive Office,Executive Director,False,False,,87360,312000,,213391,,18106,20070,251567,69829,5147,8832,24583,108391,1.667% @ 57.5,https://careers.octa.net/octa-careers/,,09/19/2017,Orange,Transportation Planning,,Transportation Planning Agencies
2016,Special District,Orange County Transportation Authority,Chief Executive Office,Executive Director,False,False,,87360,312000,,221599,,10452,19238,251289,69559,5516,6812,25455,107342,1.667% @ 57.5,https://careers.octa.net/octa-careers/,,09/19/2017,Orange,Transportation Planning,,Transportation Planning Agencies
2016,Special District,Orange County Transportation Authority,Planning,Director,False,False,,87360,312000,,199189,,30990,17421,247600,17141,3664,10092,28352,59249,2% @ 55,https://careers.octa.net/octa-careers/,,09/19/2017,Orange,Transportation Planning,,Transportation Planning Agencies
2016,Special District,Orange County Transportation Authority,Chief Executive Office,General Manager,False,False,,87360,312000,,212522,,13347,18740,244609,67245,5535,10981,18085,101846,1.667% @ 57.5,https://careers.octa.net/octa-careers/,,09/19/2017,Orange,Transportation Planning,,Transportation Planning Agencies
2016,Special District,Orange County Transportation Authority,Finance & Administration,Director,False,False,,87360,312000,,196102,,23245,23614,242961,65846,5769,6885,,78500,1.667% @ 57.5,https://careers.octa.net/octa-careers/,,09/19/2017,Orange,Transportation Planning,,Transportation Planning Agencies
2016,Special District,Orange County Transportation Authority,Chief Executive Office,Executive Director,False,False,,87360,312000,,206451,,6494,22147,235092,65599,5148,10859,24583,106189,1.667% @ 57.5,https://careers.octa.net/octa-careers/,,09/19/2017,Orange,Transportation Planning,,Transportation Planning Agencies
2016,Special District,Orange County Transportation Authority,Chief Executive Office,Executive Director,False,False,,87360,312000,,204586,,8825,16089,229500,64174,6009,5785,17912,93880,1.667% @ 57.5,https://careers.octa.net/octa-careers/,,09/19/2017,Orange,Transportation Planning,,Transportation Planning Agencies
2016,Special District,Orange County Transportation Authority,Transit,Director,False,False,,87360,312000,,201405,,9532,16501,227438,61670,4996,8092,16040,90798,1.667% @ 57.5,https://careers.octa.net/octa-careers/,,09/19/2017,Orange,Transportation Planning,,Transportation Planning Agencies
2016,Special District,Orange County Transportation Authority,Finance & Administration,Director,False,False,,87360,312000,,191287,,11051,22912,225250,60235,5039,9568,8251,83093,1.667% @ 57.5,https://careers.octa.net/octa-careers/,,09/19/2017,Orange,Transportation Planning,,Transportation Planning Agencies
2016,Special District,Orange County Transportation Authority,Capital Programs,Director,False,False,,87360,312000,,198643,,,24723,223366,61133,4365,6043,,71541,1.667% @ 57.5,https://careers.octa.net/octa-careers/,,09/19/2017,Orange,Transportation Planning,,Transportation Planning Agencies
2016,Special District,Orange County Transportation Authority,Chief Executive Office,Executive Director,False,False,,87360,312000,,184382,,6057,17946,208385,57929,4843,5770,22986,91528,1.667% @ 57.5,https://careers.octa.net/octa-careers/,,09/19/2017,Orange,Transportation Planning,,Transportation Planning Agencies
2016,Special District,Orange County Transportation Authority,External Affairs,Department Manager,False,False,,109387,164299,,157815,,22331,14049,194195,52903,5114,6462,24583,89062,1.667% @ 57.5,https://careers.octa.net/octa-careers/,,09/19/2017,Orange,Transportation Planning,,Transportation Planning Agencies
2016,Special District,Orange County Transportation Authority,Chief Executive Office,Executive Director,False,False,,87360,312000,,177578,,,9001,186579,36996,,3470,1491,41957,2.5% @ 67,https://careers.octa.net/octa-careers/,,09/19/2017,Orange,Transportation Planning,,Transportation Planning Agencies
2016,Special District,Orange County Transportation Authority,Government Relations,Program Manager,False,False,,109387,164299,,159173,,19507,7671,186351,49750,5597,6399,8251,69997,1.667% @ 57.5,https://careers.octa.net/octa-careers/,,09/19/2017,Orange,Transportation Planning,,Transportation Planning Agencies
2016,Special District,Orange County Transportation Authority,Finance & Administration,Director,False,False,,87360,312000,,162920,,8052,14026,184998,51576,4247,8575,24583,88981,1.667% @ 57.5,https://careers.octa.net/octa-careers/,,09/19/2017,Orange,Transportation Planning,,Transportation Planning Agencies
2016,Special District,Orange County Transportation Authority,Capital Programs,Program Manager,False,False,,109387,164299,,157388,,10696,15969,184053,50664,5055,3254,22986,81959,1.667% @ 57.5,https://careers.octa.net/octa-careers/,,09/19/2017,Orange,Transportation Planning,,Transportation Planning Agencies
2016,Special District,Orange County Transportation Authority,Capital Programs,Program Manager,False,False,,109387,164299,,154697,,3298,24912,182907,51258,,3254,22986,77498,1.667% @ 57.5,https://careers.octa.net/octa-careers/,,09/19/2017,Orange,Transportation Planning,,Transportation Planning Agencies
2016,Special District,Orange County Transportation Authority,Human Resources/Org Development,Department Manager,False,False,,109387,164299,,161959,,11443,8897,182299,49314,4616,11315,9795,75040,1.667% @ 57.5,https://careers.octa.net/octa-careers/,,09/19/2017,Orange,Transportation Planning,,Transportation Planning Agencies
2016,Special District,Orange County Transportation Authority,Finance & Administration,Department Manager,False,False,,109387,164299,,151340,,19488,6834,177662,48115,3777,,22504,74396,1.667% @ 57.5,https://careers.octa.net/octa-careers/,,09/19/2017,Orange,Transportation Planning,,Transportation Planning Agencies
2016,Special District,Orange County Transportation Authority,Finance & Administration,Department Manager,False,False,,109387,164299,,150725,,17465,9290,177480,49333,3581,6292,24583,83789,1.667% @ 57.5,https://careers.octa.net/octa-careers/,,09/19/2017,Orange,Transportation Planning,,Transportation Planning Agencies
2016,Special District,Orange County Transportation Authority,Government Relations,Department Manager,False,False,,109387,164299,,133118,,26061,15452,174631,43012,4841,18462,16105,82420,1.667% @ 57.5,https://careers.octa.net/octa-careers/,,09/19/2017,Orange,Transportation Planning,,Transportation Planning Agencies
2016,Special District,Orange County Transportation Authority,Transit,Department Manager,False,False,,109387,164299,,151107,,15116,7784,174007,46779,3672,7591,9795,67837,1.667% @ 57.5,https://careers.octa.net/octa-careers/,,09/19/2017,Orange,Transportation Planning,,Transportation Planning Agencies
2016,Special District,Orange County Transportation Authority,Finance & Administration,Department Manager,False,False,,109387,164299,,152630,,5269,13514,171413,45875,5158,4579,,55612,1.667% @ 57.5,https://careers.octa.net/octa-careers/,,09/19/2017,Orange,Transportation Planning,,Transportation Planning Agencies
2016,Special District,Orange County Transportation Authority,Capital Programs,Program Manager,False,False,,109387,164299,,152670,,,18421,171091,36911,,3171,10430,50512,2.5% @ 67,https://careers.octa.net/octa-careers/,,09/19/2017,Orange,Transportation Planning,,Transportation Planning Agencies
2016,Special District,Orange County Transportation Authority,Capital Programs,Project Controls Section Management,False,False,,101109,151902,,145816,,16840,5598,168254,46045,4042,4479,23337,77903,1.667% @ 57.5,https://careers.octa.net/octa-careers/,,09/19/2017,Orange,Transportation Planning,,Transportation Planning Agencies
2016,Special District,Orange County Transportation Authority,Human Resources/Org Development,Department Manager,False,False,,109387,164299,,157615,,6190,4436,168241,46540,4216,3475,21120,75351,1.667% @ 57.5,https://careers.octa.net/octa-careers/,,09/19/2017,Orange,Transportation Planning,,Transportation Planning Agencies
2016,Special District,Orange County Transportation Authority,Finance & Administration,Department Manager,False,False,,109387,164299,,151343,,7138,8551,167032,45729,3886,4702,18085,72402,1.667% @ 57.5,https://careers.octa.net/octa-careers/,,09/19/2017,Orange,Transportation Planning,,Transportation Planning Agencies
2016,Special District,Orange County Transportation Authority,Planning,Department Manager,False,False,,109387,164299,,146865,,14790,4892,166547,46649,3717,4553,21120,76039,1.667% @ 57.5,https://careers.octa.net/octa-careers/,,09/19/2017,Orange,Transportation Planning,,Transportation Planning Agencies
2016,Special District,Orange County Transportation Authority,Planning,Department Manager,False,False,,109387,164299,,149009,,5858,8362,163229,45117,3276,6224,24583,79200,1.667% @ 57.5,https://careers.octa.net/octa-careers/,,09/19/2017,Orange,Transportation Planning,,Transportation Planning Agencies
2016,Special District,Orange County Transportation Authority,External Affairs,Section Manager Senior,False,False,,101109,151902,,148555,,3304,11124,162983,44705,3737,3014,19940,71396,1.667% @ 57.5,https://careers.octa.net/octa-careers/,,09/19/2017,Orange,Transportation Planning,,Transportation Planning Agencies
2016,Special District,Orange County Transportation Authority,Finance & Administration,Department Manager,False,False,,109387,164299,,150043,,7440,5365,162848,44804,3807,4452,28352,81415,1.667% @ 57.5,https://careers.octa.net/octa-careers/,,09/19/2017,Orange,Transportation Planning,,Transportation Planning Agencies
2016,Special District,Orange County Transportation Authority,Human Resources/Org Development,Department Manager,False,False,,109387,164299,,150297,,,9188,159485,41648,3962,7519,8503,61632,1.667% @ 57.5,https://careers.octa.net/octa-careers/,,09/19/2017,Orange,Transportation Planning,,Transportation Planning Agencies
2016,Special District,Orange County Transportation Authority,Transit,Department Manager,False,False,,109387,164299,,145412,,6301,7661,159374,42249,4778,5819,8503,61349,1.667% @ 57.5,https://careers.octa.net/octa-careers/,,09/19/2017,Orange,Transportation Planning,,Transportation Planning Agencies
2016,Special District,Orange County Transportation Authority,Transit,Department Manager,False,False,,109387,164299,,136346,,11880,10238,158464,42548,3185,6893,8908,61534,1.667% @ 57.5,https://careers.octa.net/octa-careers/,,09/19/2017,Orange,Transportation Planning,,Transportation Planning Agencies
2016,Special District,Orange County Transportation Authority,Capital Programs,Program Manager,False,False,,109387,164299,,145572,,4869,6542,156983,42680,,,9070,51750,1.667% @ 57.5,https://careers.octa.net/octa-careers/,,09/19/2017,Orange,Transportation Planning,,Transportation Planning Agencies
2016,Special District,Orange County Transportation Authority,Finance & Administration,"Systems Software Analyst, Senior",False,False,,88213,131331,,125092,,17746,13779,156617,43389,4516,505,22986,71396,1.667% @ 57.5,https://careers.octa.net/octa-careers/,,09/19/2017,Orange,Transportation Planning,,Transportation Planning Agencies
2016,Special District,Orange County Transportation Authority,Finance & Administration,Data Warehouse Arch Pr,False,False,,101109,151902,,143867,,6793,5346,156006,42408,4645,,8447,55500,1.667% @ 57.5,https://careers.octa.net/octa-careers/,,09/19/2017,Orange,Transportation Planning,,Transportation Planning Agencies
2016,Special District,Orange County Transportation Authority,Transit,Assistant General Manager,False,False,,87360,312000,,117238,,26147,11918,155303,38607,3565,4755,12500,59427,1.667% @ 57.5,https://careers.octa.net/octa-careers/,,09/19/2017,Orange,Transportation Planning,,Transportation Planning Agencies
2016,Special District,Orange County Transportation Authority,Finance & Administration,Section Manager Senior,False,False,,101109,151902,,135956,,13269,5910,155135,42475,3787,2762,22504,71528,1.667% @ 57.5,https://careers.octa.net/octa-careers/,,09/19/2017,Orange,Transportation Planning,,Transportation Planning Agencies
2016,Special District,Orange County Transportation Authority,External Affairs,Department Manager,False,False,,109387,164299,,138510,,6556,9030,154096,42117,3467,7161,24583,77328,1.667% @ 57.5,https://careers.octa.net/octa-careers/,,09/19/2017,Orange,Transportation Planning,,Transportation Planning Agencies
2016,Special District,Orange County Transportation Authority,Capital Programs,Lossan Section Manager Senior,False,False,,,,,133114,,11527,9265,153906,42049,3249,2694,23337,71329,1.667% @ 57.5,https://careers.octa.net/octa-careers/,,09/19/2017,Orange,Transportation Planning,,Transportation Planning Agencies
2016,Special District,Orange County Transportation Authority,Finance & Administration,"Contracts Administrator, Princ",False,False,,88213,131331,,126935,,11796,13626,152357,41881,4377,1295,14504,62057,1.667% @ 57.5,https://careers.octa.net/octa-careers/,,09/19/2017,Orange,Transportation Planning,,Transportation Planning Agencies
2016,Special District,Orange County Transportation Authority,Finance & Administration,Department Manager,False,False,,109387,164299,,142221,,,9335,151556,41169,4787,4446,17912,68314,1.667% @ 57.5,https://careers.octa.net/octa-careers/,,09/19/2017,Orange,Transportation Planning,,Transportation Planning Agencies
2016,Special District,Orange County Transportation Authority,Planning,Program Manager,False,False,,109387,164299,,140632,,6011,4674,151317,41941,3452,4319,20339,70051,1.667% @ 57.5,https://careers.octa.net/octa-careers/,,09/19/2017,Orange,Transportation Planning,,Transportation Planning Agencies
2016,Special District,Orange County Transportation Authority,Planning,Strategic Plan Officer,False,False,,88213,131331,,142220,,4190,4808,151218,40674,4454,1382,,46510,1.667% @ 57.5,https://careers.octa.net/octa-careers/,,09/19/2017,Orange,Transportation Planning,,Transportation Planning Agencies
2016,Special District,Orange County Transportation Authority,Finance & Administration,Information Systems Section Ma,False,False,,101109,151902,,140052,,2959,7246,150257,40893,4196,1415,9070,55574,1.667% @ 57.5,https://careers.octa.net/octa-careers/,,09/19/2017,Orange,Transportation Planning,,Transportation Planning Agencies
2016,Special District,Orange County Transportation Authority,Finance & Administration,Section Manager III,False,False,,88213,131331,,125570,,17672,5782,149024,40119,3764,3793,16040,63716,1.667% @ 57.5,https://careers.octa.net/octa-careers/,,09/19/2017,Orange,Transportation Planning,,Transportation Planning Agencies
2016,Special District,Orange County Transportation Authority,Capital Programs,Program Manager,False,False,,109387,164299,,138557,,6776,3297,148630,41347,3002,4352,22986,71687,1.667% @ 57.5,https://careers.octa.net/octa-careers/,,09/19/2017,Orange,Transportation Planning,,Transportation Planning Agencies
2016,Special District,Orange County Transportation Authority,Transit,Department Manager,False,False,,109387,164299,,142763,,,5452,148215,41510,3757,2967,21120,69354,1.667% @ 57.5,https://careers.octa.net/octa-careers/,,09/19/2017,Orange,Transportation Planning,,Transportation Planning Agencies
2016,Special District,Orange County Transportation Authority,Capital Programs,Department Manager,False,False,,109387,164299,,140299,,,6734,147033,40507,2851,7244,8908,59510,1.667% @ 57.5,https://careers.octa.net/octa-careers/,,09/19/2017,Orange,Transportation Planning,,Transportation Planning Agencies
2016,Special District,Orange County Transportation Authority,Capital Programs,Project Manager III,False,False,,88213,131331,,126475,,4314,13596,144385,39987,3935,,21120,65042,1.667% @ 57.5,https://careers.octa.net/octa-careers/,,09/19/2017,Orange,Transportation Planning,,Transportation Planning Agencies
2016,Special District,Orange County Transportation Authority,Capital Programs,Department Manager,False,False,,109387,164299,,127314,,11752,4887,143953,39208,3853,,8553,51614,1.667% @ 57.5,https://careers.octa.net/octa-careers/,,09/19/2017,Orange,Transportation Planning,,Transportation Planning Agencies
2016,Special District,Orange County Transportation Authority,Planning,Program Manager,False,False,,109387,164299,,135350,,,8270,143620,12166,2600,7179,24583,46528,2% @ 55,https://careers.octa.net/octa-careers/,,09/19/2017,Orange,Transportation Planning,,Transportation Planning Agencies
2016,Special District,Orange County Transportation Authority,External Affairs,Strategic Comm Manager,False,False,,109387,164299,,134359,,,9017,143376,38977,3364,2872,7964,53177,1.667% @ 57.5,https://careers.octa.net/octa-careers/,,09/19/2017,Orange,Transportation Planning,,Transportation Planning Agencies
2016,Special District,Orange County Transportation Authority,Finance & Administration,Section Manager III,False,False,,88213,131331,,119975,,14887,7867,142729,40864,3157,3883,24583,72487,1.667% @ 57.5,https://careers.octa.net/octa-careers/,,09/19/2017,Orange,Transportation Planning,,Transportation Planning Agencies
2016,Special District,Orange County Transportation Authority,Planning,Section Manager Senior,False,False,,101109,151902,,130490,,6295,5172,141957,39268,3860,2685,23337,69150,1.667% @ 57.5,https://careers.octa.net/octa-careers/,,09/19/2017,Orange,Transportation Planning,,Transportation Planning Agencies
2016,Special District,Orange County Transportation Authority,Finance & Administration,Deputy Treasurer,False,False,,88213,131331,,123764,,10940,6777,141481,39281,3182,2589,24583,69635,1.667% @ 57.5,https://careers.octa.net/octa-careers/,,09/19/2017,Orange,Transportation Planning,,Transportation Planning Agencies
2016,Special District,Orange County Transportation Authority,Transit,Service Planning Analyst Pr,False,False,,88213,131331,,120200,,15615,5560,141375,38396,2966,3708,18085,63155,1.667% @ 57.5,https://careers.octa.net/octa-careers/,,09/19/2017,Orange,Transportation Planning,,Transportation Planning Agencies
2016,Special District,Orange County Transportation Authority,Finance & Administration,"Systems Software Analyst, Senior",False,False,,88213,131331,,119532,,12388,7843,139763,38002,3225,3629,22504,67360,1.667% @ 57.5,https://careers.octa.net/octa-careers/,,09/19/2017,Orange,Transportation Planning,,Transportation Planning Agencies
2016,Special District,Orange County Transportation Authority,Capital Programs,Project Manager III,False,False,,88213,131331,,126611,,5390,7479,139480,37766,4194,1292,8553,51805,1.667% @ 57.5,https://careers.octa.net/octa-careers/,,09/19/2017,Orange,Transportation Planning,,Transportation Planning Agencies
2016,Special District,Orange County Transportation Authority,Transit,Section Manager III,False,False,,88213,131331,,124680,,7704,6909,139293,36733,4120,3762,9795,54410,1.667% @ 57.5,https://careers.octa.net/octa-careers/,,09/19/2017,Orange,Transportation Planning,,Transportation Planning Agencies
2016,Special District,Orange County Transportation Authority,Capital Programs,Lossan Deputy Mng Dir,False,False,,109387,164299,,127912,,4395,6951,139258,39118,2752,5401,24583,71854,1.667% @ 57.5,https://careers.octa.net/octa-careers/,,09/19/2017,Orange,Transportation Planning,,Transportation Planning Agencies
2016,Special District,Orange County Transportation Authority,Finance & Administration,Business Computing Solutions S,False,False,,88213,131331,,121749,,5680,11551,138980,39064,2836,3901,18085,63886,1.667% @ 57.5,https://careers.octa.net/octa-careers/,,09/19/2017,Orange,Transportation Planning,,Transportation Planning Agencies
2016,Special District,Orange County Transportation Authority,Finance & Administration,Database Admr Pr,False,False,,88213,131331,,115976,,16382,6587,138945,39761,3656,1099,22986,67502,1.667% @ 57.5,https://careers.octa.net/octa-careers/,,09/19/2017,Orange,Transportation Planning,,Transportation Planning Agencies
2016,Special District,Orange County Transportation Authority,Transit,Base Manager,False,False,,88213,131331,,118628,,11757,7151,137536,38052,2677,3660,22504,66893,1.667% @ 57.5,https://careers.octa.net/octa-careers/,,09/19/2017,Orange,Transportation Planning,,Transportation Planning Agencies
2016,Special District,Orange County Transportation Authority,Transit,Section Manager III,False,False,,88213,131331,,124943,,2749,9354,137046,37405,3126,3874,24583,68988,1.667% @ 57.5,https://careers.octa.net/octa-careers/,,09/19/2017,Orange,Transportation Planning,,Transportation Planning Agencies
2016,Special District,Orange County Transportation Authority,Transit,Base Manager,False,False,,88213,131331,,125684,,5892,5232,136808,36401,2066,3250,14794,56511,2% @ 57,https://careers.octa.net/octa-careers/,,09/19/2017,Orange,Transportation Planning,,Transportation Planning Agencies
2016,Special District,Orange County Transportation Authority,Chief Executive Office,Internal Audit Senior Manager,False,False,,101109,151902,,121564,,11186,3806,136556,36948,2766,2433,8251,50398,1.667% @ 57.5,https://careers.octa.net/octa-careers/,,09/19/2017,Orange,Transportation Planning,,Transportation Planning Agencies
2016,Special District,Orange County Transportation Authority,Transit,Section Manager III,False,False,,88213,131331,,123676,,7193,5674,136543,36477,3931,2475,8503,51386,1.667% @ 57.5,https://careers.octa.net/octa-careers/,,09/19/2017,Orange,Transportation Planning,,Transportation Planning Agencies
2016,Special District,Orange County Transportation Authority,Planning,Section Manager III,False,False,,88213,131331,,123150,,5808,6642,135600,37190,2965,2546,24583,67284,1.667% @ 57.5,https://careers.octa.net/octa-careers/,,09/19/2017,Orange,Transportation Planning,,Transportation Planning Agencies