﻿Year,EmployerType,EmployerName,DepartmentOrSubdivision,Position,ElectedOfficial,Judicial,OtherPositions,MinPositionSalary,MaxPositionSalary,ReportedBaseWage,RegularPay,OvertimePay,LumpSumPay,OtherPay,TotalWages,DefinedBenefitPlanContribution,EmployeesRetirementCostCovered,DeferredCompensationPlan,HealthDentalVision,TotalRetirementAndHealthContribution,PensionFormula,EmployerURL,EmployerPopulation,LastUpdatedDate,EmployerCounty,SpecialDistrictActivities,IncludesUnfundedLiability,SpecialDistrictType
2013,Special District,East Valley Water District,Administration,General Manager,False,False,,195000,198000,,252038,,24938,,276976,44027,18168,,,62195,2.7 @ 55,https://eastvalley.org/128/Human-Resources-Risk-Management,,08/04/2016,San Bernardino,Solid Waste Enterprise|Water Enterprise,,County Water
2013,Special District,East Valley Water District,Finance,Chief Financial Officer,False,False,,114026,138590,,147113,,1998,8088,157199,25155,7785,1200,7397,41537,2.7 @ 55,https://eastvalley.org/128/Human-Resources-Risk-Management,,08/04/2016,San Bernardino,Solid Waste Enterprise|Water Enterprise,,County Water
2013,Special District,East Valley Water District,Engineering,Project Manager,False,False,,95930,116605,,133636,,3431,4425,141492,23486,7269,900,6808,38463,2.7 @ 55,https://eastvalley.org/128/Human-Resources-Risk-Management,,08/04/2016,San Bernardino,Solid Waste Enterprise|Water Enterprise,,County Water
2013,Special District,East Valley Water District,Administration,Assistant General Manager,False,False,,135221,166005,,128509,,6065,4500,139074,20248,6267,1200,13290,41005,2.7 @ 55,https://eastvalley.org/128/Human-Resources-Risk-Management,,08/04/2016,San Bernardino,Solid Waste Enterprise|Water Enterprise,,County Water
2013,Special District,East Valley Water District,Production,Water Prod Superintendent,False,False,,91312,110989,,123530,,,14824,138354,20459,6332,,11749,38540,2.7 @ 55,https://eastvalley.org/128/Human-Resources-Risk-Management,,08/04/2016,San Bernardino,Solid Waste Enterprise|Water Enterprise,,County Water
2013,Special District,East Valley Water District,Field,"Water Serv,  Supervisor",False,False,,69597,84573,,108472,15233,6798,4306,134809,14199,4394,,15835,34428,2.7 @ 55,https://eastvalley.org/128/Human-Resources-Risk-Management,,08/04/2016,San Bernardino,Solid Waste Enterprise|Water Enterprise,,County Water
2013,Special District,East Valley Water District,Production,Lead Water Treat Oper,False,False,,61506,74734,,105069,12015,6267,11415,134766,14625,4526,,6659,25810,2.7 @ 55,https://eastvalley.org/128/Human-Resources-Risk-Management,,08/04/2016,San Bernardino,Solid Waste Enterprise|Water Enterprise,,County Water
2013,Special District,East Valley Water District,Engineering,Engineering Manager,False,False,,111238,135221,,126880,,,4000,130880,20798,6437,,18250,45485,2.7 @ 55,https://eastvalley.org/128/Human-Resources-Risk-Management,,08/04/2016,San Bernardino,Solid Waste Enterprise|Water Enterprise,,County Water
2013,Special District,East Valley Water District,Field,Water Service Suprintndt,False,False,,91312,110989,,112985,,4503,12485,129973,17541,5429,900,11749,35619,2.7 @ 55,https://eastvalley.org/128/Human-Resources-Risk-Management,,08/04/2016,San Bernardino,Solid Waste Enterprise|Water Enterprise,,County Water
2013,Special District,East Valley Water District,Production,Water Prod  Supervisor,False,False,,69597,84573,,101801,4603,1805,16226,124435,16719,5175,,2472,24366,2.7 @ 55,https://eastvalley.org/128/Human-Resources-Risk-Management,,08/04/2016,San Bernardino,Solid Waste Enterprise|Water Enterprise,,County Water
2013,Special District,East Valley Water District,Administration,Administrative Manager,False,False,,91312,110989,,113641,,2988,4175,120804,17691,5475,1200,18516,42882,2.7 @ 55,https://eastvalley.org/128/Human-Resources-Risk-Management,,08/04/2016,San Bernardino,Solid Waste Enterprise|Water Enterprise,,County Water
2013,Special District,East Valley Water District,Production,Lead Water Prod Operator,False,False,,57325,69659,,91066,7566,5786,9459,113877,12110,3748,,11845,27703,2.7 @ 55,https://eastvalley.org/128/Human-Resources-Risk-Management,,08/04/2016,San Bernardino,Solid Waste Enterprise|Water Enterprise,,County Water
2013,Special District,East Valley Water District,Field,Heavy Equip Operator,False,False,,49462,60216,,81042,14078,3025,6359,104504,9152,2833,,15835,27820,2.7 @ 55,https://eastvalley.org/128/Human-Resources-Risk-Management,,08/04/2016,San Bernardino,Solid Waste Enterprise|Water Enterprise,,County Water
2013,Special District,East Valley Water District,Field,Lead Water Svc Worker,False,False,,51958,63190,,82248,13407,2540,3279,101474,10260,3175,,14832,28267,2.7 @ 55,https://eastvalley.org/128/Human-Resources-Risk-Management,,08/04/2016,San Bernardino,Solid Waste Enterprise|Water Enterprise,,County Water
2013,Special District,East Valley Water District,Production,Water Production Oper II,False,False,,51958,63190,,77343,5120,,7806,90269,11855,3669,,6467,21991,2.7 @ 55,https://eastvalley.org/128/Human-Resources-Risk-Management,,08/04/2016,San Bernardino,Solid Waste Enterprise|Water Enterprise,,County Water
2013,Special District,East Valley Water District,Field,Water Svc Worker II,False,False,,44886,54600,,68819,11772,3293,4205,88089,7529,2330,,18250,28109,2.7 @ 55,https://eastvalley.org/128/Human-Resources-Risk-Management,,08/04/2016,San Bernardino,Solid Waste Enterprise|Water Enterprise,,County Water
2013,Special District,East Valley Water District,Administration,Hr / Safety & Regulatory Mgr,False,False,,76815,93371,,87066,,,800,87866,13700,4240,1200,17524,36664,2.7 @ 55,https://eastvalley.org/128/Human-Resources-Risk-Management,,08/04/2016,San Bernardino,Solid Waste Enterprise|Water Enterprise,,County Water
2013,Special District,East Valley Water District,Production,Water Production Oper I,False,False,,47070,57325,,72468,5036,2315,7807,87626,10466,3239,,6198,19903,2.7 @ 55,https://eastvalley.org/128/Human-Resources-Risk-Management,,08/04/2016,San Bernardino,Solid Waste Enterprise|Water Enterprise,,County Water
2013,Special District,East Valley Water District,Production,Water Production Oper II,False,False,,51958,63190,,74563,2731,,8642,85936,11838,3664,,6808,22310,2.7 @ 55,https://eastvalley.org/128/Human-Resources-Risk-Management,,08/04/2016,San Bernardino,Solid Waste Enterprise|Water Enterprise,,County Water
2013,Special District,East Valley Water District,Production,Water Quality Coordinator,False,False,,61506,74734,,75970,3726,2865,2906,85467,108941,3371,,17631,129943,2.7 @ 55,https://eastvalley.org/128/Human-Resources-Risk-Management,,08/04/2016,San Bernardino,Solid Waste Enterprise|Water Enterprise,,County Water
2013,Special District,East Valley Water District,Finance,Finance Manager,False,False,,66227,80517,,82038,,,3401,85439,12880,3986,1200,12199,30265,2.7 @ 55,https://eastvalley.org/128/Human-Resources-Risk-Management,,08/04/2016,San Bernardino,Solid Waste Enterprise|Water Enterprise,,County Water
2013,Special District,East Valley Water District,Production,Water Production Oper II,False,False,,51958,63190,,70920,3804,3901,6075,84700,9382,2904,,17813,30099,2.7 @ 55,https://eastvalley.org/128/Human-Resources-Risk-Management,,08/04/2016,San Bernardino,Solid Waste Enterprise|Water Enterprise,,County Water
2013,Special District,East Valley Water District,Administration,Public Information Officer,False,False,,69597,84573,,76748,,,6551,83299,12386,3833,1200,6309,23728,2.7 @ 55,https://eastvalley.org/128/Human-Resources-Risk-Management,,08/04/2016,San Bernardino,Solid Waste Enterprise|Water Enterprise,,County Water
2013,Special District,East Valley Water District,Field,Field Service Worker II,False,False,,44886,54600,,67775,8416,903,5314,82408,8436,2611,,13273,24320,2.7 @ 55,https://eastvalley.org/128/Human-Resources-Risk-Management,,08/04/2016,San Bernardino,Solid Waste Enterprise|Water Enterprise,,County Water
2013,Special District,East Valley Water District,Field,Lead Water Svc Worker,False,False,,51958,63190,,67375,2327,2613,9453,81768,10033,3105,,6469,19607,2.7 @ 55,https://eastvalley.org/128/Human-Resources-Risk-Management,,08/04/2016,San Bernardino,Solid Waste Enterprise|Water Enterprise,,County Water
2013,Special District,East Valley Water District,Field,Water Svc Worker II,False,False,,44886,54600,,67155,9611,2250,2475,81491,8161,2526,,17631,28318,2.7 @ 55,https://eastvalley.org/128/Human-Resources-Risk-Management,,08/04/2016,San Bernardino,Solid Waste Enterprise|Water Enterprise,,County Water
2013,Special District,East Valley Water District,Customer Service,Customer Oper Supervisor,False,False,,66227,80517,,79292,,1404,,80696,13343,4130,,5932,23405,2.7 @ 55,https://eastvalley.org/128/Human-Resources-Risk-Management,,08/04/2016,San Bernardino,Solid Waste Enterprise|Water Enterprise,,County Water
2013,Special District,East Valley Water District,Field,Heavy Equip Operator,False,False,,49462,60216,,71572,838,2783,5324,80517,10106,3128,,17365,30599,2.7 @ 55,https://eastvalley.org/128/Human-Resources-Risk-Management,,08/04/2016,San Bernardino,Solid Waste Enterprise|Water Enterprise,,County Water
2013,Special District,East Valley Water District,Engineering,Sr Engineering Tech.,False,False,,60216,73174,,76005,897,,2514,79416,12804,3963,,6546,23313,2.7 @ 55,https://eastvalley.org/128/Human-Resources-Risk-Management,,08/04/2016,San Bernardino,Solid Waste Enterprise|Water Enterprise,,County Water
2013,Special District,East Valley Water District,Field,Field Service Worker II,False,False,,44886,54600,,66777,3217,4774,3770,78538,8622,2669,,15835,27126,2.7 @ 55,https://eastvalley.org/128/Human-Resources-Risk-Management,,08/04/2016,San Bernardino,Solid Waste Enterprise|Water Enterprise,,County Water
2013,Special District,East Valley Water District,Administration,Executive Assistant,False,False,,55786,67829,,72457,3236,,1904,77597,11485,3554,600,8326,23965,2.7 @ 55,https://eastvalley.org/128/Human-Resources-Risk-Management,,08/04/2016,San Bernardino,Solid Waste Enterprise|Water Enterprise,,County Water
2013,Special District,East Valley Water District,Field,Water Svc Worker II,False,False,,44886,54600,,63586,5824,4390,3680,77480,7627,2361,,17365,27353,2.7 @ 55,https://eastvalley.org/128/Human-Resources-Risk-Management,,08/04/2016,San Bernardino,Solid Waste Enterprise|Water Enterprise,,County Water
2013,Special District,East Valley Water District,Field,Water Svc Worker II,False,False,,44886,54600,,64460,8551,,3945,76956,7995,2474,,16301,26770,2.7 @ 55,https://eastvalley.org/128/Human-Resources-Risk-Management,,08/04/2016,San Bernardino,Solid Waste Enterprise|Water Enterprise,,County Water
2013,Special District,East Valley Water District,Customer Service,Sr Customer Service Rep,False,False,,47070,57325,,64386,8495,3614,,76495,7576,2345,,15371,25292,2.7 @ 55,https://eastvalley.org/128/Human-Resources-Risk-Management,,08/04/2016,San Bernardino,Solid Waste Enterprise|Water Enterprise,,County Water
2013,Special District,East Valley Water District,Engineering,Engineer. Exec. Assist.,False,False,,55786,67829,,71150,1602,1304,1716,75772,11474,3551,,7719,22744,2.7 @ 55,https://eastvalley.org/128/Human-Resources-Risk-Management,,08/04/2016,San Bernardino,Solid Waste Enterprise|Water Enterprise,,County Water
2013,Special District,East Valley Water District,Administration,Executive Assistant,False,False,,55786,67829,,67622,2651,2366,1748,74387,10381,3213,600,7312,21506,2.7 @ 55,https://eastvalley.org/128/Human-Resources-Risk-Management,,08/04/2016,San Bernardino,Solid Waste Enterprise|Water Enterprise,,County Water
2013,Special District,East Valley Water District,Field,Field Service Worker II,False,False,,44886,54600,,63735,5917,,4525,74177,8301,2569,,13607,24477,2.7 @ 55,https://eastvalley.org/128/Human-Resources-Risk-Management,,08/04/2016,San Bernardino,Solid Waste Enterprise|Water Enterprise,,County Water
2013,Special District,East Valley Water District,Field,Utility Svcs Worker,False,False,,51958,63190,,67527,593,2528,2788,73436,9927,3072,,14902,27901,2.7 @ 55,https://eastvalley.org/128/Human-Resources-Risk-Management,,08/04/2016,San Bernardino,Solid Waste Enterprise|Water Enterprise,,County Water
2013,Special District,East Valley Water District,Field,Lead Equip Mechanic,False,False,,55786,67829,,69167,1447,,1497,72111,10566,3270,,16166,30002,2.7 @ 55,https://eastvalley.org/128/Human-Resources-Risk-Management,,08/04/2016,San Bernardino,Solid Waste Enterprise|Water Enterprise,,County Water
2013,Special District,East Valley Water District,Field,Office Specialist I,False,False,,34299,41642,,68777,39,,3261,72077,11569,3581,,5799,20949,2.7 @ 55,https://eastvalley.org/128/Human-Resources-Risk-Management,,08/04/2016,San Bernardino,Solid Waste Enterprise|Water Enterprise,,County Water
2013,Special District,East Valley Water District,Field,Water Svc Worker II,False,False,,44886,54600,,60249,4941,1044,3486,69720,8118,2512,,11749,22379,2.7 @ 55,https://eastvalley.org/128/Human-Resources-Risk-Management,,08/04/2016,San Bernardino,Solid Waste Enterprise|Water Enterprise,,County Water
2013,Special District,East Valley Water District,Administration,Assistant General Manager,False,False,,135221,166005,,48519,,15463,1000,64982,5633,1743,,3093,10469,2.7 @ 55,https://eastvalley.org/128/Human-Resources-Risk-Management,,08/04/2016,San Bernardino,Solid Waste Enterprise|Water Enterprise,,County Water
2013,Special District,East Valley Water District,Finance,Office Specialist II,False,False,,43742,53165,,58896,2368,511,2758,64533,9103,2817,,6302,18222,2.7 @ 55,https://eastvalley.org/128/Human-Resources-Risk-Management,,08/04/2016,San Bernardino,Solid Waste Enterprise|Water Enterprise,,County Water
2013,Special District,East Valley Water District,Finance,Accounting Specialist II,False,False,,44886,54600,,60198,3406,,622,64226,9254,2864,,8563,20681,2.7 @ 55,https://eastvalley.org/128/Human-Resources-Risk-Management,,08/04/2016,San Bernardino,Solid Waste Enterprise|Water Enterprise,,County Water
2013,Special District,East Valley Water District,Engineering,Engineering Tech II,False,False,,51958,63190,,61676,,760,,62436,9250,2863,,14636,26749,2.7 @ 55,https://eastvalley.org/128/Human-Resources-Risk-Management,,08/04/2016,San Bernardino,Solid Waste Enterprise|Water Enterprise,,County Water
2013,Special District,East Valley Water District,Engineering,Engineering Tech I,False,False,,45947,55786,,58402,,,2522,60924,9499,2940,,6883,19322,2.7 @ 55,https://eastvalley.org/128/Human-Resources-Risk-Management,,08/04/2016,San Bernardino,Solid Waste Enterprise|Water Enterprise,,County Water
2013,Special District,East Valley Water District,Finance,Information Systems Coordinator,False,False,,50648,61506,,55708,2011,,2846,60565,8449,2615,,7398,18462,2.7 @ 55,https://eastvalley.org/128/Human-Resources-Risk-Management,,08/04/2016,San Bernardino,Solid Waste Enterprise|Water Enterprise,,County Water
2013,Special District,East Valley Water District,Field,Equipment Mechanic II,False,False,,48173,58552,,58656,646,,1165,60467,8687,2689,,13607,24983,2.7 @ 55,https://eastvalley.org/128/Human-Resources-Risk-Management,,08/04/2016,San Bernardino,Solid Waste Enterprise|Water Enterprise,,County Water
2013,Special District,East Valley Water District,Finance,It Manager,False,False,,60216,73175,,53215,,,5808,59023,8524,2638,1200,3439,15801,2 @ 62,https://eastvalley.org/128/Human-Resources-Risk-Management,,08/04/2016,San Bernardino,Solid Waste Enterprise|Water Enterprise,,County Water
2013,Special District,East Valley Water District,Customer Service,Office Specialist II,False,False,,35984,43742,,54760,211,2045,500,57516,7620,2358,,15931,25909,2.7 @ 55,https://eastvalley.org/128/Human-Resources-Risk-Management,,08/04/2016,San Bernardino,Solid Waste Enterprise|Water Enterprise,,County Water
2013,Special District,East Valley Water District,Finance,Storekeeper / Buyer II,False,False,,45947,55786,,55926,328,,1248,57502,8219,2544,,14902,25665,2.7 @ 55,https://eastvalley.org/128/Human-Resources-Risk-Management,,08/04/2016,San Bernardino,Solid Waste Enterprise|Water Enterprise,,County Water
2013,Special District,East Valley Water District,Customer Service,Receptionist,False,False,,33488,40685,,51639,677,1852,983,55151,7497,2320,,9457,19274,2.7 @ 55,https://eastvalley.org/128/Human-Resources-Risk-Management,,08/04/2016,San Bernardino,Solid Waste Enterprise|Water Enterprise,,County Water
2013,Special District,East Valley Water District,Engineering,Engineering Tech I,False,False,,45947,55786,,54349,,,,54349,7977,2469,,14636,25082,2.7 @ 55,https://eastvalley.org/128/Human-Resources-Risk-Management,,08/04/2016,San Bernardino,Solid Waste Enterprise|Water Enterprise,,County Water
2013,Special District,East Valley Water District,Customer Service,Cust Service Rep II,False,False,,39728,48172,,46900,1694,,2800,51394,6205,1920,,16432,24557,2.7 @ 55,https://eastvalley.org/128/Human-Resources-Risk-Management,,08/04/2016,San Bernardino,Solid Waste Enterprise|Water Enterprise,,County Water
2013,Special District,East Valley Water District,Finance,Accounting Specialist II,False,False,,44886,54600,,51088,,,125,51213,7435,2273,,16016,25724,2.7 @ 55,https://eastvalley.org/128/Human-Resources-Risk-Management,,08/04/2016,San Bernardino,Solid Waste Enterprise|Water Enterprise,,County Water
2013,Special District,East Valley Water District,Finance,Accounting Supervisor,False,False,,66227,80517,,47810,,,2489,50299,8098,2506,,3551,14155,2.7 @ 55,https://eastvalley.org/128/Human-Resources-Risk-Management,,08/04/2016,San Bernardino,Solid Waste Enterprise|Water Enterprise,,County Water
2013,Special District,East Valley Water District,Field,Water Svc Worker I,False,False,,39728,48173,,43758,680,,2557,46995,6583,2037,,6563,15183,2.7 @ 55,https://eastvalley.org/128/Human-Resources-Risk-Management,,08/04/2016,San Bernardino,Solid Waste Enterprise|Water Enterprise,,County Water
2013,Special District,East Valley Water District,Customer Service,Cust Service Rep I,False,False,,39728,48172,,40302,750,,3442,44494,5577,1726,,7981,15284,2.7 @ 55,https://eastvalley.org/128/Human-Resources-Risk-Management,,08/04/2016,San Bernardino,Solid Waste Enterprise|Water Enterprise,,County Water
2013,Special District,East Valley Water District,Customer Service,Cust Service Rep I,False,False,,39728,48172,,40511,391,,,40902,6021,1864,,5618,13503,2.7 @ 55,https://eastvalley.org/128/Human-Resources-Risk-Management,,08/04/2016,San Bernardino,Solid Waste Enterprise|Water Enterprise,,County Water
2013,Special District,East Valley Water District,Field,Water Svc Worker I,False,False,,39728,48173,,33668,423,,,34091,5497,1276,,4988,11761,2 @ 62,https://eastvalley.org/128/Human-Resources-Risk-Management,,08/04/2016,San Bernardino,Solid Waste Enterprise|Water Enterprise,,County Water
2013,Special District,East Valley Water District,Field,Water Svc Worker I,False,False,,39728,48173,,29882,530,,,30412,4854,1127,,4408,10389,2 @ 62,https://eastvalley.org/128/Human-Resources-Risk-Management,,08/04/2016,San Bernardino,Solid Waste Enterprise|Water Enterprise,,County Water
2013,Special District,East Valley Water District,Customer Service,Cust Service Rep !,False,False,,35984,43742,,27706,513,,,28219,4436,,,4408,8844,2 @ 62,https://eastvalley.org/128/Human-Resources-Risk-Management,,08/04/2016,San Bernardino,Solid Waste Enterprise|Water Enterprise,,County Water
2013,Special District,East Valley Water District,Field,Field Service Worker II,False,False,,44886,54600,,25685,,,1495,27180,4107,1271,,3503,8881,2.7 @ 55,https://eastvalley.org/128/Human-Resources-Risk-Management,,08/04/2016,San Bernardino,Solid Waste Enterprise|Water Enterprise,,County Water
2013,Special District,East Valley Water District,Board Member,Director,True,False,,,,,16975,,,,16975,,,,,0,,https://eastvalley.org/128/Human-Resources-Risk-Management,,08/04/2016,San Bernardino,Solid Waste Enterprise|Water Enterprise,,County Water
2013,Special District,East Valley Water District,Board Member,Director,True,False,,,,,16214,,,,16214,,,,,0,,https://eastvalley.org/128/Human-Resources-Risk-Management,,08/04/2016,San Bernardino,Solid Waste Enterprise|Water Enterprise,,County Water
2013,Special District,East Valley Water District,Board Member,Director,True,False,,,,,13650,,,,13650,,,,,0,,https://eastvalley.org/128/Human-Resources-Risk-Management,,08/04/2016,San Bernardino,Solid Waste Enterprise|Water Enterprise,,County Water
2013,Special District,East Valley Water District,Field,Water Svc Worker I,False,False,,39728,48173,,8295,57,458,,8810,1009,312,,3048,4369,2 @ 62,https://eastvalley.org/128/Human-Resources-Risk-Management,,08/04/2016,San Bernardino,Solid Waste Enterprise|Water Enterprise,,County Water
2013,Special District,East Valley Water District,Administration,Intern,False,False,,18720,18720,,8356,,,,8356,,,,,0,,https://eastvalley.org/128/Human-Resources-Risk-Management,,08/04/2016,San Bernardino,Solid Waste Enterprise|Water Enterprise,,County Water
2013,Special District,East Valley Water District,Board Member,Director,True,False,,,,,6001,,,,6001,1129,,,,1129,,https://eastvalley.org/128/Human-Resources-Risk-Management,,08/04/2016,San Bernardino,Solid Waste Enterprise|Water Enterprise,,County Water
2013,Special District,East Valley Water District,Board Member,Director,True,False,,,,,5775,,,,5775,,,,,0,,https://eastvalley.org/128/Human-Resources-Risk-Management,,08/04/2016,San Bernardino,Solid Waste Enterprise|Water Enterprise,,County Water
2013,Special District,East Valley Water District,Finance,Accounting Supervisor,False,False,,66227,80517,,5255,,,,5255,1019,,,,1019,2.7 @ 55,https://eastvalley.org/128/Human-Resources-Risk-Management,,08/04/2016,San Bernardino,Solid Waste Enterprise|Water Enterprise,,County Water
2013,Special District,East Valley Water District,Engineering,Intern,False,False,,43742,53165,,2844,,,,2844,,,,,0,,https://eastvalley.org/128/Human-Resources-Risk-Management,,08/04/2016,San Bernardino,Solid Waste Enterprise|Water Enterprise,,County Water

